{"text_format":"1","workbook":"xlsx","n_sheets":2,"sheets":["Form","AZ"],"not_rendered":{"charts":0,"images":0,"macros":1,"external_links":0,"defined_names":4,"comments":0,"pivot_tables":0},"unopened":[],"bounds":{"document_bytes":16777216,"sheet_cells":100000,"rows_first":2000,"rows_last":500,"rows_between":2000,"halvings":0,"cell_chars":16384,"cell_head_chars":4096},"cells_cut":0,"cells_raw":0,"read":"whole","date_system":"1900"}

{"sheet":"Form","index":0,"n_rows":214,"n_cols":6,"rows_kept":214,"cut":false,"hidden":false,"merged":[[0,1,0,2],[3,1,3,3],[4,1,4,3],[5,1,5,3],[6,1,6,3],[7,1,7,3],[8,1,8,3],[9,1,9,3],[10,1,10,3],[12,1,12,3],[13,1,13,3],[14,1,14,3],[15,1,15,3],[16,1,16,3],[18,1,18,3],[19,1,19,3],[20,1,20,3],[21,1,21,3],[22,1,22,3],[23,1,23,3],[25,1,25,3],[26,1,26,3],[27,1,27,3],[28,1,28,3],[29,1,29,3],[30,1,30,3],[31,1,31,3],[32,1,32,3],[33,1,33,3],[34,1,34,3],[35,1,35,3],[36,1,36,3],[37,1,37,3],[38,1,38,3],[39,1,39,3],[40,1,40,3],[41,1,41,3],[42,1,42,3],[44,0,44,3],[46,0,46,3]]}
["Select municipality and business zone: ","Bugojno, Bugojno1"]
[]
["General info",null," "]
["Name of the business zone",{"$f":"IF(VLOOKUP($B$1,AZ!A2:AM200,3)=\"\",\"\",VLOOKUP($B$1,AZ!A2:AM200,3))","v":"Bugojno1"}]
["Purpose (specialized, industrial, entrepreneurial-crafts, agricultural)",{"$f":"IF(VLOOKUP($B$1,AZ!$A$2:$AM$200,4)=\"\",\"\",VLOOKUP($B$1,AZ!$A$2:$AM$200,4))","v":"Entrepreneurial-craft"}]
["Municipality, canton / region",{"$f":"IF(VLOOKUP($B$1,AZ!$A$2:$AM$200,5)=\"\",\"\",VLOOKUP($B$1,AZ!$A$2:$AM$200,5))","v":"Bugojno, Central Bosnia Canton, Central BiH Region"}]
["Location (address) of the business zone",{"$f":"IF(VLOOKUP($B$1,AZ!$A$2:$AM$200,6)=\"\",\"\",VLOOKUP($B$1,AZ!$A$2:$AM$200,6))","v":"70230 Bugojno, Armije BiH 171"}]
["Coordinates",{"$f":"IF(VLOOKUP($B$1,AZ!$A$2:$AM$200,7)=\"\",\"\",VLOOKUP($B$1,AZ!$A$2:$AM$200,7))","v":"44°03'19\"N 17°24'42\"E"}]
["Terrain properties (flat, hilly...)",{"$f":"IF(VLOOKUP($B$1,AZ!$A$2:$AM$200,8)=\"\",\"\",VLOOKUP($B$1,AZ!$A$2:$AM$200,8))","v":"Flat"}]
["Risk of flooding",{"$f":"IF(VLOOKUP($B$1,AZ!$A$2:$AM$200,9)=\"\",\"\",VLOOKUP($B$1,AZ!$A$2:$AM$200,9))","v":"No"}]
["Ownership and legal status of land in the zone:\nprivate, public [%]",{"$f":"IF(VLOOKUP($B$1,AZ!$A$2:$AM$200,10)=\"\",\"\",VLOOKUP($B$1,AZ!$A$2:$AM$200,10))","v":"87,5% private 12,5% public"}]
["Contact",null," "]
["Who manages the business zone?",{"$f":"IF(VLOOKUP($B$1,AZ!$A$2:$AM$200,11)=\"\",\"\",VLOOKUP($B$1,AZ!$A$2:$AM$200,11))","v":"Municipality Bugojno"}]
["Contact persons, positions",{"$f":"IF(VLOOKUP($B$1,AZ!$A$2:$AM$200,12)=\"\",\"\",VLOOKUP($B$1,AZ!$A$2:$AM$200,12))","v":"Mr. Sead Karahodžić, Head of Department for Economy, Social Affairs and General Administration"}]
["Phone",{"$f":"IF(VLOOKUP($B$1,AZ!$A$2:$AM$200,13)=\"\",\"\",VLOOKUP($B$1,AZ!$A$2:$AM$200,13))","v":"+387 (0)30 251 210"}]
["Fax",{"$f":"IF(VLOOKUP($B$1,AZ!$A$2:$AM$200,14)=\"\",\"\",VLOOKUP($B$1,AZ!$A$2:$AM$200,14))","v":"+387 (0)30 251 210"}]
["e-mail",{"$f":"IF(VLOOKUP($B$1,AZ!$A$2:$AM$200,15)=\"\",\"\",VLOOKUP($B$1,AZ!$A$2:$AM$200,15))","v":"seadk@opcina-bugojno.ba  "}]
["Road distances from"]
["Centre of municipality [km]",{"$f":"IF(VLOOKUP($B$1,AZ!$A$2:$AM$200,16)=\"\",\"\",VLOOKUP($B$1,AZ!$A$2:$AM$200,16))","v":2.5}]
["Regional road / highway [km]",{"$f":"IF(VLOOKUP($B$1,AZ!$A$2:$AM$200,17)=\"\",\"\",VLOOKUP($B$1,AZ!$A$2:$AM$200,17))","v":"0 (roadside)"}]
["Railroad (if in the zone = 0) [km]",{"$f":"IF(VLOOKUP($B$1,AZ!$A$2:$AM$200,18)=\"\",\"\",VLOOKUP($B$1,AZ!$A$2:$AM$200,18))","v":"90 Zenica"}]
["Airport [km]",{"$f":"IF(VLOOKUP($B$1,AZ!$A$2:$AM$200,19)=\"\",\"\",VLOOKUP($B$1,AZ!$A$2:$AM$200,19))","v":"135 Sarajevo"}]
["The nearest police station [km]",{"$f":"IF(VLOOKUP($B$1,AZ!$A$2:$AM$200,20)=\"\",\"\",VLOOKUP($B$1,AZ!$A$2:$AM$200,20))","v":""}]
["The nearest fire brigade [km]",{"$f":"IF(VLOOKUP($B$1,AZ!$A$2:$AM$200,21)=\"\",\"\",VLOOKUP($B$1,AZ!$A$2:$AM$200,21))","v":""}]
["Size and infrastructure of the zone"]
["Total surface [ha]",{"$f":"IF(VLOOKUP($B$1,AZ!$A$2:$AM$200,22)=\"\",\"\",VLOOKUP($B$1,AZ!$A$2:$AM$200,22))","v":37}]
["Estimated price of land in the zone [KM/ m2]",{"$f":"IF(VLOOKUP($B$1,AZ!$A$2:$AM$200,23)=\"\",\"\",VLOOKUP($B$1,AZ!$A$2:$AM$200,23))","v":"Min. 8 Max. 30"}]
["The land divided into parcels? (if so, the number of plots)",{"$f":"IF(VLOOKUP($B$1,AZ!$A$2:$AM$200,24)=\"\",\"\",VLOOKUP($B$1,AZ!$A$2:$AM$200,24))","v":77}]
["Zone free area for expansion [ha]",{"$f":"IF(VLOOKUP($B$1,AZ!$A$2:$AM$200,25)=\"\",\"\",VLOOKUP($B$1,AZ!$A$2:$AM$200,25))","v":0}]
["Availability of project documentation for the area of the zone?",{"$f":"IF(VLOOKUP($B$1,AZ!$A$2:$AM$200,26)=\"\",\"\",VLOOKUP($B$1,AZ!$A$2:$AM$200,26))","v":"No"}]
["Model of land management (sales, rental)",{"$f":"IF(VLOOKUP($B$1,AZ!$A$2:$AM$200,27)=\"\",\"\",VLOOKUP($B$1,AZ!$A$2:$AM$200,27))","v":"Sales"}]
["Occupancy [%]",{"$f":"IF(VLOOKUP($B$1,AZ!$A$2:$AM$200,28)=\"\",\"\",VLOOKUP($B$1,AZ!$A$2:$AM$200,28))","v":80}]
["Electricity",{"$f":"IF(VLOOKUP($B$1,AZ!$A$2:$AM$200,29)=\"\",\"\",VLOOKUP($B$1,AZ!$A$2:$AM$200,29))","v":"Yes"}]
["The highest incoming voltage in the zone [kV]",{"$f":"IF(VLOOKUP($B$1,AZ!$A$2:$AM$200,30)=\"\",\"\",VLOOKUP($B$1,AZ!$A$2:$AM$200,30))","v":""}]
["Gas [ Yes/No ]",{"$f":"IF(VLOOKUP($B$1,AZ!$A$2:$AM$200,31)=\"\",\"\",VLOOKUP($B$1,AZ!$A$2:$AM$200,31))","v":"No"}]
["Gas pressure in the gas pipeline network [kPa]\n(eg. 100 kPa = 1 ba)",{"$f":"IF(VLOOKUP($B$1,AZ!$A$2:$AM$200,32)=\"\",\"\",VLOOKUP($B$1,AZ!$A$2:$AM$200,32))","v":"Not applicable"}]
["Water - drinking / technological [ Yes / No ]",{"$f":"IF(VLOOKUP($B$1,AZ!$A$2:$AM$200,33)=\"\",\"\",VLOOKUP($B$1,AZ!$A$2:$AM$200,33))","v":"Yes"}]
["Volume flow of water at the zone entrance [l / sec]\nor pressure [kPa] (eg. 100 kPa = 1 ba)",{"$f":"IF(VLOOKUP($B$1,AZ!$A$2:$AM$200,34)=\"\",\"\",VLOOKUP($B$1,AZ!$A$2:$AM$200,34))","v":""}]
["Drainage of waste water (sewage)",{"$f":"IF(VLOOKUP($B$1,AZ!$A$2:$AM$200,35)=\"\",\"\",VLOOKUP($B$1,AZ!$A$2:$AM$200,35))","v":"Yes"}]
["The possibility of solid waste disposal [ Yes/No ]",{"$f":"IF(VLOOKUP($B$1,AZ!$A$2:$AM$200,36)=\"\",\"\",VLOOKUP($B$1,AZ!$A$2:$AM$200,36))","v":"Yes"}]
["Telephone [ Yes/No ]",{"$f":"IF(VLOOKUP($B$1,AZ!$A$2:$AM$200,37)=\"\",\"\",VLOOKUP($B$1,AZ!$A$2:$AM$200,37))","v":"Yes"}]
["Internet [Yes/No ]",{"$f":"IF(VLOOKUP($B$1,AZ!$A$2:$AM$200,38)=\"\",\"\",VLOOKUP($B$1,AZ!$A$2:$AM$200,38))","v":""}]
["Transport infrastructure within the zone [ Yes/No ]",{"$f":"IF(VLOOKUP($B$1,AZ!$A$2:$AM$200,39)=\"\",\"\",VLOOKUP($B$1,AZ!$A$2:$AM$200,39))","v":"Yes"}]
["Incentives for users of the business zone"]
[{"$f":"IF(VLOOKUP($B$1,AZ!$A$2:$AN$200,40)=\"\",\"\",VLOOKUP($B$1,AZ!$A$2:$AN$200,40))","v":""}]
["Other useful information"]
[{"$f":"IF(VLOOKUP($B$1,AZ!$A$2:$AO$200,41)=\"\",\"\",VLOOKUP($B$1,AZ!$A$2:$AO$200,41))","v":""}]
[]
["Users of the business zone"]
["Name and location of registered office","Sector (manufacturing, services, trade)","Registered business","Number\nof employees","Filter","ZoneName"]
["AGRO VOĆE Donji Vakuf, PJ Bugojno","Services","Packaging of sugar ",null,{"$f":"IF(ISERROR(VLOOKUP(F51,$A$51:$F1474,6,1)),\"\",\"False\")","v":"False"},"Bugojno, Bugojno1"]
["ALUSIL Zn d.o.o. Bugojno","Production","Castings",5,{"$f":"IF(ISERROR(VLOOKUP(F52,$A$51:$F$1500,1,0)),\"\",\"True\")","v":""},"Bugojno, Bugojno1"]
["AXLE d.o.o. Bugojno","Services","Architecture and engineering",3,{"$f":"IF(ISERROR(VLOOKUP(F53,$B$1:$B3,1,0)),\"\",\"True\")","v":"True"},"Bugojno, Bugojno1"]
["CPT d.o.o.","Services","Packaging of cosmetics",5,{"$f":"IF(ISERROR(VLOOKUP(F54,$B$1:$B4,1,0)),\"\",\"True\")","v":"True"},"Bugojno, Bugojno1"]
["DELJKOVIĆ d.o.o. Bugojno","Production","Leather footwear",55,{"$f":"IF(ISERROR(VLOOKUP(F55,$B$1:$B5,1,0)),\"\",\"True\")","v":"True"},"Bugojno, Bugojno1"]
["KA PLIN d.o.o. Bugojno","Trade","Gas",null,{"$f":"IF(ISERROR(VLOOKUP(F56,$B$1:$B6,1,0)),\"\",\"True\")","v":"True"},"Bugojno, Bugojno1"]
["MAJAMI & CO d.o.o. Bugojno","Services","Real estate agency",2,{"$f":"IF(ISERROR(VLOOKUP(F57,$B$1:$B7,1,0)),\"\",\"True\")","v":"True"},"Bugojno, Bugojno1"]
["MAKAP d.o.o. Bugojno","Production ","Textile",72,{"$f":"IF(ISERROR(VLOOKUP(F58,$B$1:$B8,1,0)),\"\",\"True\")","v":"True"},"Bugojno, Bugojno1"]
["MLM ALUTEC d.o.o. Bugojno","Production","Aluminum castings",48,{"$f":"IF(ISERROR(VLOOKUP(F59,$B$1:$B9,1,0)),\"\",\"True\")","v":"True"},"Bugojno, Bugojno1"]
["NEIMAR s.z.r. Bugojno","Services","Construction",3,{"$f":"IF(ISERROR(VLOOKUP(F60,$B$1:$B10,1,0)),\"\",\"True\")","v":"True"},"Bugojno, Bugojno1"]
{"$rows_left_out":155}
{"sheet":"AZ","index":1,"n_rows":22,"n_cols":41,"rows_kept":22,"cut":false,"hidden":false,"merged":[]}
["Municipality, Name of the business zone","Municipality","Business zone","Purpose (specialized, industrial, entrepreneurial-crafts, agricultural)","Municipality, canton / region","Location (address) of the business zone","Coordinates","Terrain properties (flat, hilly...)","Risk of flooding","Ownership and legal status of land in the zone: private, public [%]","Who manages the business zone?","Contact persons, positions","Phone","Fax","e-mail","Distance from centre of municipality [km]","Distance from regional road / highway [km]","Distance from railroad (if in the zone = 0) [km]","Distance from airport [km]","Distance from the nearest police station [km]","Distance from the nearest fire brigade [km]","Total surface [ha]","Estimated price of land in the zone [KM/ m2]","The land divided into parcels? (if so, the number of plots)","Zone free area for expansion [ha]","Availability of project documentation for the area of the zone?","Model of land management (sales, rental)","Occupancy [%]","Electricity","The highest incoming voltage in the zone [kV]","Gas [ Yes/No ]","Gas pressure in the gas pipeline network [kPa] (eg. 100 kPa = 1 ba)","Water - drinking / technological [ Yes / No ]","Volume flow of water at the zone entrance [l / sec] or pressure [kPa]\n(eg. 100 kPa = 1 ba)","Drainage of waste water (sewage)","The possibility of solid waste disposal [Yes/No]","Telephone [Yes/No]","Internet [Yes/No]","Transport infrastructure within the zone [Yes/No]","Incentives","Other useful information"]
[{"$f":"B2&\", \"&C2","v":"Bugojno, Bugojno1"},"Bugojno","Bugojno1","Entrepreneurial-craft","Bugojno, Central Bosnia Canton, Central BiH Region","70230 Bugojno, Armije BiH 171","44°03'19\"N 17°24'42\"E","Flat","No","87,5% private 12,5% public","Municipality Bugojno","Mr. Sead Karahodžić, Head of Department for Economy, Social Affairs and General Administration","+387 (0)30 251 210","+387 (0)30 251 210","seadk@opcina-bugojno.ba  ",2.5,"0 (roadside)","90 Zenica","135 Sarajevo",null,null,37,"Min. 8 Max. 30",77,0,"No","Sales",80,"Yes",null,"No","Not applicable","Yes",null,"Yes","Yes","Yes",null,"Yes"]
[{"$f":"B3&\", \"&C3","v":"Busovača, Kaonik"},"Busovača","Kaonik","Entrepreneurial-craft","Busovača, Central Bosnia Canton, Central BiH Region","72260 Busovača, Kaonik bb","44°07'35.4\"N 17°53'15.1\"E","Flat","No","100% private 0% public","Municipality Busovača","Mr. Edin Šabanović, Head of Department for Local Development","+387 (0)30 732 152","+387 (0)30 733 038","opcinabusovaca1@tel.net.ba   ",3.5,"<1 (regional M-5); 7 (highway A-1)",5,"60 Sarajevo",null,null,20,null,null,null,null,"Sales",null,"Yes",null,null,null,"Yes",null,"Yes","Yes","Yes",null,"Yes"]
[{"$f":"B4&\", \"&C4","v":"Doboj Jug, Matuzići"},"Doboj Jug","Matuzići","Entrepreneurial-craft","Doboj Jug, Zenica-Doboj Canton, Central BiH Region","74203 Doboj Jug, Usorska bb","44°42'02.8\"N 18°02'43.3\"E","Flat","Yes","87,5% private 12,5% public","Municipality Doboj Jug","Mr. Afan Aličić, Officer for Economy and Agriculture","+387 (0)32 691 335","+387 (0)32 691 335","dobojjug@dobojjug.ba ",{"$f":"\"<\"&1","v":"<1"},"< 1",3,"70 Tuzla; 150 Sarajevo",null,null,7.5,null,null,null,"Yes","Sales",40,"Yes",null,"No","Not applicable","Yes",null,"Yes","Yes","Yes",null,"Yes","For production facilities fee is reduced by 50%, and reduction of the fee for plot preparation is already included in the price per one square meter."]
[{"$f":"B5&\", \"&C5","v":"Gornji Vakuf-Uskoplje, Batuški lug"},"Gornji Vakuf-Uskoplje","Batuški lug","Entrepreneurial-craft","Gornji Vakuf-Uskoplje, Central Bosnia Canton,  Central BiH Region","70240 Gornji Vakuf-Uskoplje, Batuški lug bb","43°56'54.53\"N  17°34'46.65\"E","Flat","No","0% private 100% public","Municipality Gornji Vakuf-Uskoplje","Mr. Sead Čaušević, Municipality Mayor","+387 (0)30 494 068","+387 (0)30 494 068","nacelnik@gornjivakuf-uskoplje.ba   ",2,1,"90 Zenica","130 Sarajevo",null,null,50,7,13,null,"Yes","Sales",30,"Yes",null,"No","Not applicable","Yes",null,"Yes","Yes","Yes",null,"Yes"]
["Kakanj, Vrtlište","Kakanj","Vrtlište","Entrepreneurial-craft","Kakanj,  Zenica-Doboj Canton, Central BiH Region","72240 Kakanj, Open-pit coal mine Vrtlište","44°07'49.0\"N 18°05'51.4\"E","Flat",null,"0% private 100% public","Municipality Kakanj","Fadil Merdić, Head of the Department of Entrepreneurship","+387 (0)32 553 491","+387 (0)32 771 809","fadil.merdic@gmail.com ",2,"1,5 (regional R-445); 2 (highway A-1)",1.5,"45 Sarajevo",null,null,9.8000000000000007,null,30,"No","Yes","Sales",null,"Yes (at the entrance)",null,"No","Not applicable","Yes (at the entrance)",null,"No","No","No","No","No"]
["Maglaj, Liješnica","Maglaj","Liješnica","Industrial and entrepreneurial","Maglaj, Zenica-Doboj Canton, Central BiH Region","72240 Maglaj, Liješnica bb","44°31'40.87\"N 18°05'46.42\"E","Flat","No","80% private 20% public","Municipality Maglaj","Mr. Ferhat Bradarić, Head of Department for local development, business and entrepreneurship","+387 (0)32 609 550; +387 (0)32 609 583","+387 (0)32 609 551","ferhat@maglaj.ba; nacelnik@maglaj.ba ",2,"0 (roadside M-17)",2,"130 Sarajevo",2,2,16,20,null,2,"Yes","Sales",20,"Yes",null,"No","Not applicable","Yes",null,null,"Yes","Yes","Yes","Yes"]
["Maglaj, Misurići","Maglaj","Misurići","Entrepreneurial-craft","Maglaj, Zenica-Doboj Canton, Central BiH Region","72240 Maglaj, Misurići bb","44°32'57.1\"N 18°05'32.4\"E","Flat","No","0% private 100% public","Municipality Maglaj","Mr. Ferhat Bradarić, Head of Department for local development, business and entrepreneurship","+387 (0)32 609 550; +387 (0)32 609 583","+387 (0)32 609 551","ferhat@maglaj.ba; nacelnik@maglaj.ba ",1,"0 (roadside M-17)","< 1","130 Sarajevo","< 1",1,6.2,25,18,null,"Yes","Sales",20,"Yes",null,"No","Not applicable","Yes",null,"No","No","Yes","Yes","Yes"]
["Novi Travnik, Bratstvo","Novi Travnik","Bratstvo","Entrepreneurial-craft","Novi Travnik, Central Bosnia Canton, Central BiH Region","72290 Novi Travnik, Poslovno-industrijska zona BNT","44°09'43.2\"N 17°38'32.4\"E","Flat","No","80% private 20% public","BNT Holding d.d. Novi Travnik","Šaban Rizvić, Director","+387(0)30 525 007",null,"bratstvo.holding@gmail.com   ",1.5,"0 (roadside  M-16.4)","40 Zenica","90 Sarajevo",null,null,64,null,null,null,"Yes","Sales",62,"Yes",null,"No","Not applicable","Yes",null,"Yes","Yes","Yes",null,"Yes"]
["Novi Travnik, Neobarje","Novi Travnik","Neobarje","Business center and industrial-services","Novi Travnik, Central Bosnia Canton, Central BiH Region","72290 Novi Travnik, Neobarje bb","44°11'34.3\"N 17°41'35.8\"E","Flat","No",null,"Municipality Novi Travnik","Mr. Branko Brkan, Head of Department for Economy, Development, Restructuring and Housing","+387 (0)30 795 600","+387 (0)30 795 608","opcina.novi.travnik@tel.net.ba   ",3,"0 (roadside  M-16.4)","40 Zenica","90 Sarajevo",null,null,57.03,null,63,null,"Yes","Sales",11,"Under construction",null,"No","Not applicable","Under construction",null,"Under construction",null,"Under construction",null,"Under construction",null,"Divided in 63 plots sized between 0.3 and 1 hectare. Development of infrastructure (roads, water supply, sewage) is ongoing process. Feasibility study for the zone has been made within the EUSESBI Project (financed from IPA). So far seven investors have bought plots in the business zone."]
["Teslić, Borja","Teslić","Borja","Entrepreneurial-craft (Brownfield)","Teslić, Republika Srpska, Central BiH Region","74270 Teslić, Svetog Save bb","44°36'22.4\"N 17°50'49.5\"E","Flat","Yes","0% private 100% public","Municipality Teslić","Mr. Dragan Mišić, Head of the Department for Development","+387 (0)53 411 552","+387 (0)53 411 552","dragan.misic@opstinateslic.com ","<1","<1",20,100,null,null,6.3,null,null,null,"Yes","Sales",35,"Yes",null,"Yes",null,"Yes",null,"Yes","Yes","Yes","Yes","No",null,"The zone is the complex of mechanical and chemical wood processing Teslić, with related infrastructure."]
["Teslić, Lanara","Teslić","Lanara","Entrepreneurial-craft","Teslić, Republika Srpska, Central BiH Region","74270 Teslić, Kralja Petra I","44.596533°N 17.857699°E","Flat",null,"72% private 18% public","Municipality Teslić","Mr. Dragan Mišić, Head of the Department for Development","+387 (0)53 411 552","+387 (0)53 411 552","dragan.misic@opstinateslic.com ","<1","<1",20,100,null,null,63,null,null,null,null,"Sales",37,"Yes",null,"No",null,"Yes",null,"Yes","Yes",null,null,"Yes"]
["Teslić, Žarkovačka polja","Teslić","Žarkovačka polja","Entrepreneurial-craft (Brownfield)","Teslić, Republika Srpska, Central BiH Region","74270 Teslić, M4","44°37'46.3\" N 17°51'23.3\" E","Flat",null,"0% private 100% public","Municipality Teslić","Mr. Dragan Mišić, Head of the Department for Development","+387 (0)53 411 552","+387 (0)53 411 552","dragan.misic@opstinateslic.com ",5,"<1 (M4)",15,100,null,null,40,null,null,null,"Yes","Sales",50,"Yes",null,"No","Not applicable","Yes",null,"Yes","Yes","Yes",null,"Yes"]
["Tešanj, Bukva-Vila","Tešanj","Bukva-Vila","Entrepreneurial-crafts (Brownfield)","Tešanj, Zenica-Doboj Canton, Central BiH Region","74260 Tešanj, MZ Bukva","44°37'52\"N 18°00'21\"E","Flat (Bukva), slightly sloping (Vila)","No",null,"Municipality Tešanj","Mr. Hamzalija Hojkurić, Assistant Mayor; \nMr. Ismar Alagić, Director of Development Agency Tešanj","+387 (0)32 650 022 (Municipality); +387 (0)32 650 608 (TRA - Development Agency Tešanj)","+387 (0)32 650 220 (Municipality); +387 (0)32 650 390 (TRA - Development Agency Tešanj)","hamzalija.hojkuric@opcina-tesanj.ba; tra@opcina-tesanj.ba ",2,6,15,80,null,null,68.33,null,null,null,"Yes","Sales",null,"Yes",null,"No","Not applicable","Yes",null,"Yes","Yes","Yes",null,"Yes","1. Land is granted without fee, provided that the investor starts with the business within two years, employs a minimum of 50 workers in the first year of operation, continuously increases at least 10 newly employed each year in the period of 10 years, and operates at least 20 years.\n2. All entrepreneurs who invest in Business Zone \"Bukva\" on public or private land are free of all taxes and fees that are regulated by the municipal decisions","Earlier established business zone \"Bukva\" expanded to a new micro location \"Vila\", which was completed with the construction of the intra zonal roads with supporting infrastructure (water supply and sewage) in 80% predicted by the plan. Construction of water supply and sewerage networks in the function of the preparatory micro location for inclusion of new companies in the business zone of Bukva."]
["Tešanj, Glinište","Tešanj","Glinište","Entrepreneurial-craft (Brownfield or Green)","Tešanj, Zenica-Doboj Canton, Central BiH Region","74260 Tešanj, Jelah (Rosulje, Vukovo)",null,"Slightly sloping","No","Mixed","Municipality Tešanj","Mr. Hamzalija Hojkurić, Assistant Mayor; \nMr. Ismar Alagić, Director of Development Agency Tešanj","+387 (0)32 650 022 (Municipality); +387 (0)32 650 608 (TRA - Development Agency Tešanj)","+387 (0)32 650 220 (Municipality); +387 (0)32 650 390 (TRA - Development Agency Tešanj)","hamzalija.hojkuric@opcina-tesanj.ba; tra@opcina-tesanj.ba ",13,0.2,7,70,null,null,76,25,"Partly (public only)","No","Yes","Sales",null,"Yes",null,"No","Not applicable","Yes",null,"No","Yes","Yes",null,"Partly","Construction site fee is paid in accordance with Construction site resolution. For business and industrial facilities 500.00 to 1,000.00 KM, maximum fee is 500.00 KM, while for facilities over 1,000.00 KM maximum fee is 1,000.00 KM."]
["Travnik, Polje","Travnik","Polje","Entrepreneurial-craft","Travnik, Central Bosnia Canton, Central BiH Region","72270 Travnik, Dolac na Lašvi",null,"Flat","Yes","Public 100%","Municipality Travnik","Ms. Elma Pružan, Advisor for Economics ","+387 (0)30 501 277","+387 (0)30 501 277","elma.pruzan@opcinatravnik.com.ba ",3,0,"40 Zenica","100 Sarajevo",null,null,74.3,15,"No",null,"Yes",null,null,"Yes",null,"No","Not applicable","No",null,"No","Yes","Yes",null,"Yes"]
["Usora, Žabljak","Usora","Žabljak","Entrepreneurial-craft","Usora, Zenica-Doboj Canton, Central BiH Region","74230 Usora, Sivša bb","44°40'33.17\"N 18°00'52.78\"E","Flat","Partly","38% private 62% public","Municipality Usora","Mr. Anto Bonić, Head of Department for Economy and Finance","+387 (0)32 899 447","+387 (0)32 893 514","info@usora-opcina.com ",6,"0,5 (M-4) 7 (M-17)","13 Doboj","75 Tuzla",null,null,5,null,15,null,"Yes","Sales",null,"Yes",null,"No","Not applicable","Yes",null,"No","Yes","No","No","No","(1) Deferred payment of municipal contributions for 12 months (2) Exemption of utility fees in the 1st investment  year (3) 75% of utility fees in the 2nd investment year (4) 50% of utility fees in the 3rd investment year (5) 25% of utility fees in the 4th investment year"]
["Vitez, PC-96","Vitez","PC-96","Entrepreneurial-craft","Vitez, Central Bosnia Canton, Central BiH Region","72250 Vitez, PC-96","44°10'08.26\"N 17°46'57.63\"E","Flat","No","Mixed","Municipality Vitez","Mr. Muhamed Rebihić, Head of Department of Entrepreneurship and Local Development","+387 (0)30 718 213","+387 (0)30 713 939","lokalni.razvoj@gmail.com  ",3,0,"15 Zenica","70 Sarajevo",null,null,145,18,180,"No","Yes","Sales",null,"Yes",null,"No","Not applicable","Yes",null,"Yes","Yes (collecting, disposal and transportation)","Yes","Yes","Yes","50% refund of of the rent."]
["Vitez, Vitezit","Vitez","Vitezit","Entrepreneurial-craft","Vitez, Central Bosnia Canton, Central BiH Region","72250 Vitez, Poslovni sistem Vitezit","44°9'10.44\"N 17°45'49.68\"E","Flat","No","100% public","Municipality Vitez","Mr. Muhamed Rebihić, Head of Department of Entrepreneurship and Local Development","+387 (0)30 718 213","+387 (0)30 713 939","lokalni.razvoj@gmail.com  ",3,0,"16 Zenica","70 Sarajevo",null,null,220,10,null,"No","Yes","Sales",null,"Yes",null,"No","Not applicable","Yes",null,"Yes","Yes","Yes",null,"Yes"]
["Zavidovići, Ekonomija-Batvice","Zavidovići","Ekonomija-Batvice","Entrepreneurial-craft","Zavidovići, Zenica-Doboj Canton, Central BiH Region","72220 Zavidovići, Krivajska bb","44°27'05.47\"N 18°09'51.20\"E","Flat","No","The municipality owns the infrastructure and free plots in the business zone (100%); other plots are private property","Municipality Zavidovići","Mr. Almir Mustafić, Senior Associate for entrepreneurship, tourism, development and ecology","+387 (0)32 878 318","+387 (0)32 868 230","opzdici@bih.net.ba",1.5,"12 (M-17)",2,"125 Sarajevo",1.5,1,32.659999999999997,"Sales by auction. The rent/cadastre (5,29 KM/m2) and plot preparation (2.64 KM/m2) fees are included in the auction starting price. ","19 (three plots remained for sale)",0,"Yes","Sales",84,"Yes","2 x 10 kV","No","Not applicable","Sewage network built","650 kPa  (6.5 bar)","Yes","Yes","Yes","Yes","Yes","The municipality did not establish additional incentives for users of the business zone, but the low level of all municipal fees creates a favorable business environment for the economy in general."]
["Zenica, Zenica1","Zenica","Zenica1","Entrepreneurial-craft","Zenica, Zenica-Doboj Canton, Central BiH Region","72000 Zenica, Zmaja od Bosne bb","44°12'41.6\"N 17°54'03.4\"E","Flat","No","100% public","City of Zenica","Suvad Dizdarević, Head of the Department of Economic Affairs","+387 (0)32 449 410","+387 (0)32 449 415","suvad.dizdarevic@gmail.com",1.5,2.5,0,80,1.5,"<1",33.64,"50 (bidding starting price)",35,null,"Yes","Sales",null,"Yes",null,"Yes",null,"Yes",null,"Yes","Yes","Yes","Yes","Yes","Incentives for calculation of rents and fees for land development in the construction of manufacturing space."]
["Žepče, Polja","Žepče","Polja","Entrepreneurial-craft (Green)","Žepče, Zenica-Doboj Canton, Central BiH Region","72230 Žepče","44°25'43.8\"N 18°02'30.2\"E","Flat","No","Mixed","Municipality Žepče","Mr. Namik Malićbegović, Assistant Mayor (Municipality); Ms. Maja Jukić, Manager for SMEs (RAŽ – Development Agency Žepče)\n","+387 (0)32 888 630 (Municipality); +387 (0)32 888 273 (RAŽ – Development Agency Žepče)","+387 (0)32 888 608 (Municipality); +387 (0)32 888 273 (RAŽ - Development Agency Žepče)","namik.malićbegović@tel.net.ba; razepce@gmail.com ",1,"2 (M-17)","< 1","100 Sarajevo",null,null,"11.2","Min. 15 Max. 20",5,null,"Yes","Sales",null,"Yes",null,"No","Not applicable","Yes",null,"Yes","Yes","Yes",null,"No","(1) Building a billboard (2) Building and maintenance of street lighting (3) Maintenance of the road network in the zone"]